Reaction Details
TargetKinesin-like protein KIF11
LigandBDBM23772
Substrate/Competitorn/a
Meas. Tech.ChEMBL_940910 (CHEMBL2330556)
Ki 107±n/a nM
Citation Good, JAWang, FRath, OKaan, HYTalapatra, SKPodgórski, DMacKay, SPKozielski, F Optimized S-trityl-L-cysteine-based inhibitors of kinesin spindle protein with potent in vivo antitumor activity in lung cancer xenograft models. J Med Chem56:1878-93 (2013) 
 
Kinesin-like protein KIF11
Name:Kinesin-like protein KIF11
Type:PROTEIN
Mol. Mass.:119138.97
Organism:Homo sapiens (Human)
Description:ChEMBL_1457426
Residue:1056
BDBM23772
NameBDBM23772
Synonyms:(2R)-2-amino-3-[(triphenylmethyl)sulfanyl]propanoic acid CHEMBL392695 S-Trityl-L-Cysteine (STLC), 1 Tritylcysteine
TypeSmall organic molecule
Emp. Form.C22H21NO2S
Mol. Mass.363.473
SMILESN[C@@H](CSC(c1ccccc1)(c1ccccc1)c1ccccc1)C(O)=O