Reaction Details
TargetKinesin-like protein KIF11
LigandBDBM50382589
Substrate/Competitorn/a
Meas. Tech.ChEMBL_940910 (CHEMBL2330556)
Ki 23±n/a nM
Citation Good, JAWang, FRath, OKaan, HYTalapatra, SKPodgórski, DMacKay, SPKozielski, F Optimized S-trityl-L-cysteine-based inhibitors of kinesin spindle protein with potent in vivo antitumor activity in lung cancer xenograft models. J Med Chem56:1878-93 (2013) 
 
Kinesin-like protein KIF11
Name:Kinesin-like protein KIF11
Type:PROTEIN
Mol. Mass.:119138.97
Organism:Homo sapiens (Human)
Description:ChEMBL_1457426
Residue:1056
BDBM50382589
NameBDBM50382589
Synonyms:CHEMBL2022982
TypeSmall organic molecule
Emp. Form.C23H25NS
Mol. Mass.347.516
SMILESCCc1cccc(c1)C(SCCN)(c1ccccc1)c1ccccc1