Reaction Details
TargetKinesin-like protein KIF11
LigandBDBM50427286
Substrate/Competitorn/a
Meas. Tech.ChEMBL_940910 (CHEMBL2330556)
Ki 7.1±n/a nM
Citation Good, JAWang, FRath, OKaan, HYTalapatra, SKPodgórski, DMacKay, SPKozielski, F Optimized S-trityl-L-cysteine-based inhibitors of kinesin spindle protein with potent in vivo antitumor activity in lung cancer xenograft models. J Med Chem56:1878-93 (2013) 
 
Kinesin-like protein KIF11
Name:Kinesin-like protein KIF11
Type:PROTEIN
Mol. Mass.:119138.97
Organism:Homo sapiens (Human)
Description:ChEMBL_1457426
Residue:1056
BDBM50427286
NameBDBM50427286
Synonyms:CHEMBL2321913
TypeSmall organic molecule
Emp. Form.C22H23NOS
Mol. Mass.349.489
SMILESCc1ccc(cc1)C(SCCN)(c1ccccc1)c1cccc(O)c1