Reaction Details
TargetKinesin-like protein KIF11
LigandBDBM50427288
Substrate/Competitorn/a
Meas. Tech.ChEMBL_940910 (CHEMBL2330556)
Ki 56±n/a nM
Citation Good, JAWang, FRath, OKaan, HYTalapatra, SKPodgórski, DMacKay, SPKozielski, F Optimized S-trityl-L-cysteine-based inhibitors of kinesin spindle protein with potent in vivo antitumor activity in lung cancer xenograft models. J Med Chem56:1878-93 (2013) 
 
Kinesin-like protein KIF11
Name:Kinesin-like protein KIF11
Type:PROTEIN
Mol. Mass.:119138.97
Organism:Homo sapiens (Human)
Description:ChEMBL_1457426
Residue:1056
BDBM50427288
NameBDBM50427288
Synonyms:CHEMBL2325423
TypeSmall organic molecule
Emp. Form.C23H24N2OS
Mol. Mass.376.514
SMILESCc1ccc(cc1)C(SCCN)(c1ccccc1)c1cccc(c1)C(N)=O