Reaction Details
TargetKinesin-like protein KIF11
LigandBDBM50427278
Substrate/Competitorn/a
Meas. Tech.ChEMBL_938549 (CHEMBL2327388)
Ki 16±n/a nM
Citation Good, JAWang, FRath, OKaan, HYTalapatra, SKPodgórski, DMacKay, SPKozielski, F Optimized S-trityl-L-cysteine-based inhibitors of kinesin spindle protein with potent in vivo antitumor activity in lung cancer xenograft models. J Med Chem56:1878-93 (2013) 
 
Kinesin-like protein KIF11
Name:Kinesin-like protein KIF11
Type:PROTEIN
Mol. Mass.:119138.97
Organism:Homo sapiens (Human)
Description:ChEMBL_1457426
Residue:1056
BDBM50427278
NameBDBM50427278
Synonyms:CHEMBL2325414
TypeSmall organic molecule
Emp. Form.C26H27NO2S
Mol. Mass.417.563
SMILESN[C@@H](CSC(c1ccccc1)(c1ccccc1)c1ccc2CCCCc2c1)C(O)=O