Reaction Details
TargetKinesin-like protein KIF11
LigandBDBM50427294
Substrate/Competitorn/a
Meas. Tech.ChEMBL_938549 (CHEMBL2327388)
Ki 0.500000±n/a nM
Citation Good, JAWang, FRath, OKaan, HYTalapatra, SKPodgórski, DMacKay, SPKozielski, F Optimized S-trityl-L-cysteine-based inhibitors of kinesin spindle protein with potent in vivo antitumor activity in lung cancer xenograft models. J Med Chem56:1878-93 (2013) 
 
Kinesin-like protein KIF11
Name:Kinesin-like protein KIF11
Type:PROTEIN
Mol. Mass.:119138.97
Organism:Homo sapiens (Human)
Description:ChEMBL_1457426
Residue:1056
BDBM50427294
NameBDBM50427294
Synonyms:CHEMBL2325429 | SB-743921
TypeSmall organic molecule
Emp. Form.C31H33ClN2O3
Mol. Mass.517.058
SMILESCC(C)[C@@H](N(CCCN)C(=O)c1ccc(C)cc1)c1oc2cc(Cl)ccc2c(=O)c1Cc1ccccc1