Reaction Details
TargetRho-associated protein kinase 2
LigandBDBM50427339
Substrate/Competitorn/a
Meas. Tech.ChEMBL_941085 (CHEMBL2330882)
IC50 3149±n/a nM
Citation Addie, MBallard, PButtar, DCrafter, CCurrie, GDavies, BRDebreczeni, JDry, HDudley, PGreenwood, RJohnson, PDKettle, JGLane, CLamont, GLeach, ALuke, RWMorris, JOgilvie, DPage, KPass, MPearson, SRuston, L Discovery of 4-amino-N-[(1S)-1-(4-chlorophenyl)-3-hydroxypropyl]-1-(7H-pyrrolo[2,3-d]pyrimidin-4-yl)piperidine-4-carboxamide (AZD5363), an orally bioavailable, potent inhibitor of Akt kinases. J Med Chem56:2059-73 (2013) 
 
Rho-associated protein kinase 2
Name:Rho-associated protein kinase 2
Type:Protein
Mol. Mass.:160885.43
Organism:Homo sapiens (Human)
Description:O75116
Residue:1388
BDBM50427339
NameBDBM50427339
Synonyms:CHEMBL2325989
TypeSmall organic molecule
Emp. Form.C19H23N7O
Mol. Mass.365.4322
SMILESCC(NC(=O)C1(N)CCN(CC1)c1ncnc2[nH]ccc12)c1ccccn1