Reaction Details
TargetRAC-gamma serine/threonine-protein kinase
LigandBDBM50427333
Substrate/Competitorn/a
Meas. Tech.ChEMBL_941087 (CHEMBL2330884)
IC50 15±n/a nM
Citation Addie, MBallard, PButtar, DCrafter, CCurrie, GDavies, BRDebreczeni, JDry, HDudley, PGreenwood, RJohnson, PDKettle, JGLane, CLamont, GLeach, ALuke, RWMorris, JOgilvie, DPage, KPass, MPearson, SRuston, L Discovery of 4-amino-N-[(1S)-1-(4-chlorophenyl)-3-hydroxypropyl]-1-(7H-pyrrolo[2,3-d]pyrimidin-4-yl)piperidine-4-carboxamide (AZD5363), an orally bioavailable, potent inhibitor of Akt kinases. J Med Chem56:2059-73 (2013) 
 
RAC-gamma serine/threonine-protein kinase
Name:RAC-gamma serine/threonine-protein kinase
Type:Enzyme
Mol. Mass.:55769.36
Organism:Homo sapiens (Human)
Description:n/a
Residue:479
BDBM50427333
NameBDBM50427333
Synonyms:CHEMBL2325995 US11236095, Example 48 | US9492453, 48
TypeSmall organic molecule
Emp. Form.C26H34ClN7O2
Mol. Mass.512.047
SMILESNC1(CCN(CC1)c1ncnc2[nH]ccc12)C(=O)NC(CCCN1CCOCC1)c1ccc(Cl)cc1