Reaction Details
TargetProtein kinase C theta type
LigandBDBM50427366
Substrate/Competitorn/a
Meas. Tech.ChEMBL_941193 (CHEMBL2329704)
Ki 1±n/a nM
Citation Jimenez, JMBoyall, DBrenchley, GCollier, PNDavis, CJFraysse, DKeily, SBHenderson, JMiller, APierard, FSettimo, LTwin, HCBolton, CMCurnock, APChiu, PTanner, AJYoung, S Design and optimization of selective protein kinase C¿ (PKC¿) inhibitors for the treatment of autoimmune diseases. J Med Chem56:1799-810 (2013) 
 
Protein kinase C theta type
Name:Protein kinase C theta type
Type:Serine/threonine-protein kinase
Mol. Mass.:81878.04
Organism:Homo sapiens (Human)
Description:Full-length human PKC theta (Panvera Catalog No. P2996).
Residue:706
BDBM50427366
NameBDBM50427366
Synonyms:CHEMBL2325999
TypeSmall organic molecule
Emp. Form.C21H24FN7O
Mol. Mass.409.46
SMILESCC(C)[C@@](C)(O)[C@@H]1CN(CCN1)c1nc(-c2n[nH]c3ncccc23)c(F)cc1C#N