Reaction Details
TargetProtein kinase C alpha type
LigandBDBM50427362
Substrate/Competitorn/a
Meas. Tech.ChEMBL_941117 (CHEMBL2330914)
Ki 1230±n/a nM
Citation Jimenez, JMBoyall, DBrenchley, GCollier, PNDavis, CJFraysse, DKeily, SBHenderson, JMiller, APierard, FSettimo, LTwin, HCBolton, CMCurnock, APChiu, PTanner, AJYoung, S Design and optimization of selective protein kinase C¿ (PKC¿) inhibitors for the treatment of autoimmune diseases. J Med Chem56:1799-810 (2013) 
 
Protein kinase C alpha type
Name:Protein kinase C alpha type
Type:Enzyme
Mol. Mass.:76755.65
Organism:Homo sapiens (Human)
Description:The recombinant human PKC enzymes were produced using a baculovirus expression system in SF9 cells
Residue:672
BDBM50427362
NameBDBM50427362
Synonyms:CHEMBL2326014
TypeSmall organic molecule
Emp. Form.C15H16N6
Mol. Mass.280.3277
SMILESC1CN(CCN1)c1cccc(n1)-c1n[nH]c2ncccc12