Reaction Details
TargetProtein kinase C alpha type
LigandBDBM50427366
Substrate/Competitorn/a
Meas. Tech.ChEMBL_941117 (CHEMBL2330914)
Ki>1250±n/a nM
Citation Jimenez, JMBoyall, DBrenchley, GCollier, PNDavis, CJFraysse, DKeily, SBHenderson, JMiller, APierard, FSettimo, LTwin, HCBolton, CMCurnock, APChiu, PTanner, AJYoung, S Design and optimization of selective protein kinase C¿ (PKC¿) inhibitors for the treatment of autoimmune diseases. J Med Chem56:1799-810 (2013) 
 
Protein kinase C alpha type
Name:Protein kinase C alpha type
Type:Enzyme
Mol. Mass.:76755.65
Organism:Homo sapiens (Human)
Description:The recombinant human PKC enzymes were produced using a baculovirus expression system in SF9 cells
Residue:672
BDBM50427366
NameBDBM50427366
Synonyms:CHEMBL2325999
TypeSmall organic molecule
Emp. Form.C21H24FN7O
Mol. Mass.409.46
SMILESCC(C)[C@@](C)(O)[C@@H]1CN(CCN1)c1nc(-c2n[nH]c3ncccc23)c(F)cc1C#N