Reaction Details
TargetProtein kinase C delta type
LigandBDBM50427369
Substrate/Competitorn/a
Meas. Tech.ChEMBL_941118 (CHEMBL2330915)
Ki 547±n/a nM
Citation Jimenez, JMBoyall, DBrenchley, GCollier, PNDavis, CJFraysse, DKeily, SBHenderson, JMiller, APierard, FSettimo, LTwin, HCBolton, CMCurnock, APChiu, PTanner, AJYoung, S Design and optimization of selective protein kinase C¿ (PKC¿) inhibitors for the treatment of autoimmune diseases. J Med Chem56:1799-810 (2013) 
 
Protein kinase C delta type
Name:Protein kinase C delta type
Type:Enzyme
Mol. Mass.:77516.79
Organism:Homo sapiens (Human)
Description:The recombinant human PKC enzymes were produced using a baculovirus expression system in SF9 cells
Residue:676
BDBM50427369
NameBDBM50427369
Synonyms:CHEMBL2326012
TypeSmall organic molecule
Emp. Form.C20H25ClN6O
Mol. Mass.400.905
SMILESCC(C)[C@@](C)(O)[C@@H]1CN(CCN1)c1ccc(Cl)c(n1)-c1n[nH]c2ncccc12