Reaction Details
TargetProtein kinase C delta type
LigandBDBM50427372
Substrate/Competitorn/a
Meas. Tech.ChEMBL_941118 (CHEMBL2330915)
Ki 480±n/a nM
Citation Jimenez, JMBoyall, DBrenchley, GCollier, PNDavis, CJFraysse, DKeily, SBHenderson, JMiller, APierard, FSettimo, LTwin, HCBolton, CMCurnock, APChiu, PTanner, AJYoung, S Design and optimization of selective protein kinase C¿ (PKC¿) inhibitors for the treatment of autoimmune diseases. J Med Chem56:1799-810 (2013) 
 
Protein kinase C delta type
Name:Protein kinase C delta type
Type:Enzyme
Mol. Mass.:77516.79
Organism:Homo sapiens (Human)
Description:The recombinant human PKC enzymes were produced using a baculovirus expression system in SF9 cells
Residue:676
BDBM50427372
NameBDBM50427372
Synonyms:CHEMBL2326011
TypeSmall organic molecule
Emp. Form.C21H27FN6O
Mol. Mass.398.4771
SMILESCOC(C)(C(C)C)C1CN(CCN1)c1ccc(F)c(n1)-c1n[nH]c2ncccc12