Reaction Details
TargetProtein kinase C theta type
LigandBDBM50427379
Substrate/Competitorn/a
Meas. Tech.ChEMBL_941193 (CHEMBL2329704)
Ki 4.0±n/a nM
Citation Jimenez, JMBoyall, DBrenchley, GCollier, PNDavis, CJFraysse, DKeily, SBHenderson, JMiller, APierard, FSettimo, LTwin, HCBolton, CMCurnock, APChiu, PTanner, AJYoung, S Design and optimization of selective protein kinase C¿ (PKC¿) inhibitors for the treatment of autoimmune diseases. J Med Chem56:1799-810 (2013) 
 
Protein kinase C theta type
Name:Protein kinase C theta type
Type:Serine/threonine-protein kinase
Mol. Mass.:81878.04
Organism:Homo sapiens (Human)
Description:Full-length human PKC theta (Panvera Catalog No. P2996).
Residue:706
BDBM50427379
NameBDBM50427379
Synonyms:CHEMBL2326003
TypeSmall organic molecule
Emp. Form.C19H23FN6
Mol. Mass.354.4245
SMILESCC(C)C[C@H]1CN(CCN1)c1ccc(F)c(n1)-c1n[nH]c2ncccc12