Reaction Details
TargetProtein kinase C theta type
LigandBDBM50387333
Substrate/Competitorn/a
Meas. Tech.ChEMBL_941193 (CHEMBL2329704)
Ki 32±n/a nM
Citation Jimenez, JMBoyall, DBrenchley, GCollier, PNDavis, CJFraysse, DKeily, SBHenderson, JMiller, APierard, FSettimo, LTwin, HCBolton, CMCurnock, APChiu, PTanner, AJYoung, S Design and optimization of selective protein kinase C¿ (PKC¿) inhibitors for the treatment of autoimmune diseases. J Med Chem56:1799-810 (2013) 
 
Protein kinase C theta type
Name:Protein kinase C theta type
Type:Serine/threonine-protein kinase
Mol. Mass.:81878.04
Organism:Homo sapiens (Human)
Description:Full-length human PKC theta (Panvera Catalog No. P2996).
Residue:706
BDBM50387333
NameBDBM50387333
Synonyms:CHEMBL2046626
TypeSmall organic molecule
Emp. Form.C15H17N5O
Mol. Mass.283.3284
SMILESNc1ncccc1C(=O)c1cccc(n1)N1CCNCC1