Reaction Details
TargetTyrosine-protein kinase ZAP-70
LigandBDBM50427363
Substrate/Competitorn/a
Meas. Tech.ChEMBL_941105 (CHEMBL2330902)
Ki>1000±n/a nM
Citation Jimenez, JMBoyall, DBrenchley, GCollier, PNDavis, CJFraysse, DKeily, SBHenderson, JMiller, APierard, FSettimo, LTwin, HCBolton, CMCurnock, APChiu, PTanner, AJYoung, S Design and optimization of selective protein kinase C¿ (PKC¿) inhibitors for the treatment of autoimmune diseases. J Med Chem56:1799-810 (2013) 
 
Tyrosine-protein kinase ZAP-70
Name:Tyrosine-protein kinase ZAP-70
Type:Enzyme
Mol. Mass.:69881.61
Organism:Homo sapiens (Human)
Description:ZAP-70 SH2 domain was expressed and purified from E. coli using O-phospho-L-tyrosine-agarose column.
Residue:619
BDBM50427363
NameBDBM50427363
Synonyms:CHEMBL2326002
TypeSmall organic molecule
Emp. Form.C20H24ClFN6O
Mol. Mass.418.896
SMILESCC(C)[C@@](C)(O)[C@@H]1CN(CCN1)c1nc(-c2n[nH]c3ncccc23)c(F)cc1Cl