Reaction Details
TargetCannabinoid receptor 1
LigandBDBM50427398
Substrate/Competitorn/a
Meas. Tech.ChEMBL_941211 (CHEMBL2329722)
Ki>20000±n/a nM
Citation Yang, PWang, LFeng, RAlmehizia, AATong, QMyint, KZOuyang, QAlqarni, MHWang, LXie, XQ Novel triaryl sulfonamide derivatives as selective cannabinoid receptor 2 inverse agonists and osteoclast inhibitors: discovery, optimization, and biological evaluation. J Med Chem56:2045-58 (2013) 
 
Cannabinoid receptor 1
Name:Cannabinoid receptor 1
Type:G Protein-Coupled Receptor (GPCR)
Mol. Mass.:52868.96
Organism:Homo sapiens (Human)
Description:P21554
Residue:472
BDBM50427398
NameBDBM50427398
Synonyms:CHEMBL2326033
TypeSmall organic molecule
Emp. Form.C29H38N2O
Mol. Mass.430.6248
SMILESCCN(CC)c1ccc(CN(C(=O)Cc2ccccc2)[C@]23C[C@H]4C[C@H](C[C@H](C4)C2)C3)cc1