Reaction Details
TargetCannabinoid receptor 2
LigandBDBM50427436
Substrate/Competitorn/a
Meas. Tech.ChEMBL_941210 (CHEMBL2329721)
Ki 5193±n/a nM
Citation Yang, PWang, LFeng, RAlmehizia, AATong, QMyint, KZOuyang, QAlqarni, MHWang, LXie, XQ Novel triaryl sulfonamide derivatives as selective cannabinoid receptor 2 inverse agonists and osteoclast inhibitors: discovery, optimization, and biological evaluation. J Med Chem56:2045-58 (2013) 
 
Cannabinoid receptor 2
Name:Cannabinoid receptor 2
Type:G Protein-Coupled Receptor (GPCR)
Mol. Mass.:39690.94
Organism:Homo sapiens (Human)
Description:P34972
Residue:360
BDBM50427436
NameBDBM50427436
Synonyms:CHEMBL2326273
TypeSmall organic molecule
Emp. Form.C25H38N2O3S
Mol. Mass.446.646
SMILESCCCCCCCN(Cc1ccc(cc1)N(CC)CC)S(=O)(=O)c1ccc(OC)cc1