Reaction Details
TargetCannabinoid receptor 2
LigandBDBM50427405
Substrate/Competitorn/a
Meas. Tech.ChEMBL_941210 (CHEMBL2329721)
Ki 25±n/a nM
Citation Yang, PWang, LFeng, RAlmehizia, AATong, QMyint, KZOuyang, QAlqarni, MHWang, LXie, XQ Novel triaryl sulfonamide derivatives as selective cannabinoid receptor 2 inverse agonists and osteoclast inhibitors: discovery, optimization, and biological evaluation. J Med Chem56:2045-58 (2013) 
 
Cannabinoid receptor 2
Name:Cannabinoid receptor 2
Type:G Protein-Coupled Receptor (GPCR)
Mol. Mass.:39690.94
Organism:Homo sapiens (Human)
Description:P34972
Residue:360
BDBM50427405
NameBDBM50427405
Synonyms:CHEMBL2326307
TypeSmall organic molecule
Emp. Form.C27H35FN2O2S
Mol. Mass.470.642
SMILESCCN(CC)c1ccc(CN([C@]23C[C@H]4C[C@H](C[C@H](C4)C2)C3)S(=O)(=O)c2ccc(F)cc2)cc1