Reaction Details
TargetCannabinoid receptor 1
LigandBDBM50427408
Substrate/Competitorn/a
Meas. Tech.ChEMBL_941211 (CHEMBL2329722)
Ki 3200±n/a nM
Citation Yang, PWang, LFeng, RAlmehizia, AATong, QMyint, KZOuyang, QAlqarni, MHWang, LXie, XQ Novel triaryl sulfonamide derivatives as selective cannabinoid receptor 2 inverse agonists and osteoclast inhibitors: discovery, optimization, and biological evaluation. J Med Chem56:2045-58 (2013) 
 
Cannabinoid receptor 1
Name:Cannabinoid receptor 1
Type:G Protein-Coupled Receptor (GPCR)
Mol. Mass.:52868.96
Organism:Homo sapiens (Human)
Description:P21554
Residue:472
BDBM50427408
NameBDBM50427408
Synonyms:CHEMBL2326302
TypeSmall organic molecule
Emp. Form.C26H29ClN2O
Mol. Mass.420.974
SMILESCCN(CC)c1ccc(CN(C(=O)Cc2ccc(Cl)cc2)c2ccc(C)cc2)cc1