Reaction Details
TargetHisto-blood group ABO system transferase
LigandBDBM50427445
Substrate/Competitorn/a
Meas. Tech.ChEMBL_941223 (CHEMBL2329773)
Kd 2300000±n/a nM
Citation Schaefer, KSindhuwinata, NHackl, TKötzler, MPNiemeyer, FCPalcic, MMPeters, TMeyer, B A nonionic inhibitor with high specificity for the UDP-Gal donor binding site of human blood group B galactosyltransferase: design, synthesis, and characterization. J Med Chem56:2150-4 (2013) 
 
Histo-blood group ABO system transferase
Name:Histo-blood group ABO system transferase
Type:PROTEIN
Mol. Mass.:40947.46
Organism:Homo sapiens (Human)
Description:ChEMBL_941222
Residue:354
BDBM50427445
NameBDBM50427445
Synonyms:CHEMBL1235497
TypeSmall organic molecule
Emp. Form.C10H14N4O7
Mol. Mass.302.2408
SMILESOC[C@@H](O)[C@@H](O)[C@H](O)Cn1c2[nH]c(=O)[nH]c(=O)c2[nH]c1=O