Reaction Details
TargetNuclear factor NF-kappa-B p105 subunit
LigandBDBM50427505
Substrate/Competitorn/a
Meas. Tech.ChEMBL_941587 (CHEMBL2330627)
EC50 530000±n/a nM
Citation Marzaro, GGuiotto, ABorgatti, MFinotti, AGambari, RBreveglieri, GChilin, A Psoralen derivatives as inhibitors of NF-¿B/DNA interaction: synthesis, molecular modeling, 3D-QSAR, and biological evaluation. J Med Chem56:1830-42 (2013) 
 
Nuclear factor NF-kappa-B p105 subunit
Name:Nuclear factor NF-kappa-B p105 subunit
Type:Protein
Mol. Mass.:105329.57
Organism:Homo sapiens (Human)
Description:P19838
Residue:968
BDBM50427505
NameBDBM50427505
Synonyms:CHEMBL2322548
TypeSmall organic molecule
Emp. Form.C26H25NO6
Mol. Mass.447.4798
SMILESCc1c(CC(=O)Nc2ccc(CC(O)=O)cc2)c(=O)oc2cc3occ(c3cc12)C(C)(C)C