Reaction Details
TargetNuclear factor NF-kappa-B p105 subunit
LigandBDBM50427519
Substrate/Competitorn/a
Meas. Tech.ChEMBL_941587 (CHEMBL2330627)
EC50 3000000±n/a nM
Citation Marzaro, GGuiotto, ABorgatti, MFinotti, AGambari, RBreveglieri, GChilin, A Psoralen derivatives as inhibitors of NF-¿B/DNA interaction: synthesis, molecular modeling, 3D-QSAR, and biological evaluation. J Med Chem56:1830-42 (2013) 
 
Nuclear factor NF-kappa-B p105 subunit
Name:Nuclear factor NF-kappa-B p105 subunit
Type:Protein
Mol. Mass.:105329.57
Organism:Homo sapiens (Human)
Description:P19838
Residue:968
BDBM50427519
NameBDBM50427519
Synonyms:CHEMBL2322263
TypeSmall organic molecule
Emp. Form.C26H25NO5
Mol. Mass.431.4804
SMILESCc1c(CCC(=O)Nc2ccc(O)cc2)c(=O)oc2c(C)c3oc4CCCCc4c3cc12