Reaction Details
TargetNuclear factor NF-kappa-B p105 subunit
LigandBDBM50427530
Substrate/Competitorn/a
Meas. Tech.ChEMBL_941587 (CHEMBL2330627)
EC50 700000±n/a nM
Citation Marzaro, GGuiotto, ABorgatti, MFinotti, AGambari, RBreveglieri, GChilin, A Psoralen derivatives as inhibitors of NF-¿B/DNA interaction: synthesis, molecular modeling, 3D-QSAR, and biological evaluation. J Med Chem56:1830-42 (2013) 
 
Nuclear factor NF-kappa-B p105 subunit
Name:Nuclear factor NF-kappa-B p105 subunit
Type:Protein
Mol. Mass.:105329.57
Organism:Homo sapiens (Human)
Description:P19838
Residue:968
BDBM50427530
NameBDBM50427530
Synonyms:CHEMBL2322253
TypeSmall organic molecule
Emp. Form.C23H19NO6
Mol. Mass.405.4001
SMILESCc1oc2cc3oc(=O)c(CC(=O)Nc4cccc(c4)C(O)=O)c(C)c3cc2c1C