Reaction Details
TargetMu-type opioid receptor
LigandBDBM50427560
Substrate/Competitorn/a
Meas. Tech.ChEMBL_941601 (CHEMBL2330683)
Ki 2.6±n/a nM
Citation Mosberg, HIYeomans, LHarland, AABender, AMSobczyk-Kojiro, KAnand, JPClark, MJJutkiewicz, EMTraynor, JR Opioid peptidomimetics: leads for the design of bioavailable mixed efficacyµ opioid receptor (MOR) agonist/d opioid receptor (DOR) antagonist ligands. J Med Chem56:2139-49 (2013) 
 
Mu-type opioid receptor
Name:Mu-type opioid receptor
Type:G Protein-Coupled Receptor (GPCR)
Mol. Mass.:44503.11
Organism:Rattus norvegicus (rat)
Description:Competition binding assays were carried out using membrane preparations from transfected HN9.10 cells that constitutively expressed the mu opioid receptor.
Residue:398
BDBM50427560
NameBDBM50427560
Synonyms:CHEMBL2322564
TypeSmall organic molecule
Emp. Form.C27H31N3O2
Mol. Mass.429.5539
SMILESCc1cc(O)cc(C)c1C[C@H](N)C(=O)N[C@H]1CCNc2ccc(Cc3ccccc3)cc12