Reaction Details
TargetAdenosine receptor A3
LigandBDBM50427598
Substrate/Competitorn/a
Meas. Tech.ChEMBL_941721 (CHEMBL2330944)
Ki 2.4±n/a nM
Citation Squarcialupi, LColotta, VCatarzi, DVarano, FFilacchioni, GVarani, KCorciulo, CVincenzi, FBorea, PAGhelardini, CDi Cesare Mannelli, LCiancetta, AMoro, S 2-Arylpyrazolo[4,3-d]pyrimidin-7-amino derivatives as new potent and selective human A3 adenosine receptor antagonists. Molecular modeling studies and pharmacological evaluation. J Med Chem56:2256-69 (2013) 
 
Adenosine receptor A3
Name:Adenosine receptor A3
Type:G Protein-Coupled Receptor (GPCR)
Mol. Mass.:36197.32
Organism:Homo sapiens (Human)
Description:P0DMS8
Residue:318
BDBM50427598
NameBDBM50427598
Synonyms:CHEMBL2322924
TypeSmall organic molecule
Emp. Form.C20H17N5O2
Mol. Mass.359.3813
SMILESCOc1ccc(cc1)C(=O)Nc1nc(C)nc2cn(nc12)-c1ccccc1