Reaction Details
TargetAdenosine receptor A3
LigandBDBM50427583
Substrate/Competitorn/a
Meas. Tech.ChEMBL_941721 (CHEMBL2330944)
Ki 5.6±n/a nM
Citation Squarcialupi, LColotta, VCatarzi, DVarano, FFilacchioni, GVarani, KCorciulo, CVincenzi, FBorea, PAGhelardini, CDi Cesare Mannelli, LCiancetta, AMoro, S 2-Arylpyrazolo[4,3-d]pyrimidin-7-amino derivatives as new potent and selective human A3 adenosine receptor antagonists. Molecular modeling studies and pharmacological evaluation. J Med Chem56:2256-69 (2013) 
 
Adenosine receptor A3
Name:Adenosine receptor A3
Type:G Protein-Coupled Receptor (GPCR)
Mol. Mass.:36197.32
Organism:Homo sapiens (Human)
Description:P0DMS8
Residue:318
BDBM50427583
NameBDBM50427583
Synonyms:CHEMBL2322923
TypeSmall organic molecule
Emp. Form.C19H15N5O
Mol. Mass.329.3553
SMILESCc1nc(NC(=O)c2ccccc2)c2nn(cc2n1)-c1ccccc1