Reaction Details
TargetProstaglandin G/H synthase 2
LigandBDBM50427623
Substrate/Competitorn/a
Meas. Tech.ChEMBL_941815 (CHEMBL2329806)
IC50 90±n/a nM
Citation Liedtke, AJAdeniji, AOChen, MByrns, MCJin, YChristianson, DWMarnett, LJPenning, TM Development of potent and selective indomethacin analogues for the inhibition of AKR1C3 (Type 5 17ß-hydroxysteroid dehydrogenase/prostaglandin F synthase) in castrate-resistant prostate cancer. J Med Chem56:2429-46 (2013) 
 
Prostaglandin G/H synthase 2
Name:Prostaglandin G/H synthase 2
Type:Protein
Mol. Mass.:69020.39
Organism:Mus musculus (Mouse)
Description:Q05769
Residue:604
BDBM50427623
NameBDBM50427623
Synonyms:CHEMBL2323476
TypeSmall organic molecule
Emp. Form.C18H13ClFNO3
Mol. Mass.345.752
SMILESCc1c(CC(O)=O)c2cc(F)ccc2n1C(=O)c1ccc(Cl)cc1