Reaction Details
TargetProstaglandin G/H synthase 1
LigandBDBM50427624
Substrate/Competitorn/a
Meas. Tech.ChEMBL_941818 (CHEMBL2329809)
IC50 750±n/a nM
Citation Liedtke, AJAdeniji, AOChen, MByrns, MCJin, YChristianson, DWMarnett, LJPenning, TM Development of potent and selective indomethacin analogues for the inhibition of AKR1C3 (Type 5 17ß-hydroxysteroid dehydrogenase/prostaglandin F synthase) in castrate-resistant prostate cancer. J Med Chem56:2429-46 (2013) 
 
Prostaglandin G/H synthase 1
Name:Prostaglandin G/H synthase 1
Type:Enzyme
Mol. Mass.:68692.62
Organism:Homo sapiens (Human)
Description:P23219
Residue:599
BDBM50427624
NameBDBM50427624
Synonyms:CHEMBL2323522 | US9346803, Table 2, Compound 11: 9-(4-chlorobenzoyl)-6-methoxy-2,3,4,9-tetrahydro-1H-carbazole-3-carboxylic acid
TypeSmall organic molecule
Emp. Form.C21H18ClNO4
Mol. Mass.383.825
SMILESCOc1ccc2n(C(=O)c3ccc(Cl)cc3)c3CCC(Cc3c2c1)C(O)=O