Reaction Details
TargetAldo-keto reductase family 1 member C1
LigandBDBM50427620
Substrate/Competitorn/a
Meas. Tech.ChEMBL_941821 (CHEMBL2329812)
IC50 17730±n/a nM
Citation Liedtke, AJAdeniji, AOChen, MByrns, MCJin, YChristianson, DWMarnett, LJPenning, TM Development of potent and selective indomethacin analogues for the inhibition of AKR1C3 (Type 5 17ß-hydroxysteroid dehydrogenase/prostaglandin F synthase) in castrate-resistant prostate cancer. J Med Chem56:2429-46 (2013) 
 
Aldo-keto reductase family 1 member C1
Name:Aldo-keto reductase family 1 member C1
Type:Enzyme
Mol. Mass.:36793.97
Organism:Homo sapiens (Human)
Description:Recombinant AKR1C1 enzyme was expressed in E. coli.
Residue:323
BDBM50427620
NameBDBM50427620
Synonyms:CHEMBL2323507 | US9346803, 2
TypeSmall organic molecule
Emp. Form.C20H18ClNO4
Mol. Mass.371.814
SMILESCOc1ccc2n(C(=O)c3ccc(Cl)cc3)c(CCC(O)=O)c(C)c2c1