Reaction Details
TargetAldo-keto reductase family 1 member C2
LigandBDBM50427631
Substrate/Competitorn/a
Meas. Tech.ChEMBL_941825 (CHEMBL2329816)
IC50 12280±n/a nM
Citation Liedtke, AJAdeniji, AOChen, MByrns, MCJin, YChristianson, DWMarnett, LJPenning, TM Development of potent and selective indomethacin analogues for the inhibition of AKR1C3 (Type 5 17ß-hydroxysteroid dehydrogenase/prostaglandin F synthase) in castrate-resistant prostate cancer. J Med Chem56:2429-46 (2013) 
 
Aldo-keto reductase family 1 member C2
Name:Aldo-keto reductase family 1 member C2
Type:Enzyme
Mol. Mass.:36739.89
Organism:Homo sapiens (Human)
Description:n/a
Residue:323
BDBM50427631
NameBDBM50427631
Synonyms:CHEMBL2323510
TypeSmall organic molecule
Emp. Form.C21H20ClNO4
Mol. Mass.385.841
SMILESCOc1ccc2n(C(=O)c3ccc(Cl)cc3)c(CC(C)C(O)=O)c(C)c2c1