Reaction Details
TargetAldo-keto reductase family 1 member C2
LigandBDBM50427649
Substrate/Competitorn/a
Meas. Tech.ChEMBL_941825 (CHEMBL2329816)
IC50 23250±n/a nM
Citation Liedtke, AJAdeniji, AOChen, MByrns, MCJin, YChristianson, DWMarnett, LJPenning, TM Development of potent and selective indomethacin analogues for the inhibition of AKR1C3 (Type 5 17ß-hydroxysteroid dehydrogenase/prostaglandin F synthase) in castrate-resistant prostate cancer. J Med Chem56:2429-46 (2013) 
 
Aldo-keto reductase family 1 member C2
Name:Aldo-keto reductase family 1 member C2
Type:Enzyme
Mol. Mass.:36739.89
Organism:Homo sapiens (Human)
Description:n/a
Residue:323
BDBM50427649
NameBDBM50427649
Synonyms:CHEMBL2323488
TypeSmall organic molecule
Emp. Form.C17H11ClFNO3
Mol. Mass.331.726
SMILESOC(=O)Cc1cn(C(=O)c2ccc(Cl)cc2)c2ccc(F)cc12