Reaction Details
TargetAldo-keto reductase family 1 member C2
LigandBDBM50427629
Substrate/Competitorn/a
Meas. Tech.ChEMBL_941825 (CHEMBL2329816)
IC50 54500±n/a nM
Citation Liedtke, AJAdeniji, AOChen, MByrns, MCJin, YChristianson, DWMarnett, LJPenning, TM Development of potent and selective indomethacin analogues for the inhibition of AKR1C3 (Type 5 17ß-hydroxysteroid dehydrogenase/prostaglandin F synthase) in castrate-resistant prostate cancer. J Med Chem56:2429-46 (2013) 
 
Aldo-keto reductase family 1 member C2
Name:Aldo-keto reductase family 1 member C2
Type:Enzyme
Mol. Mass.:36739.89
Organism:Homo sapiens (Human)
Description:n/a
Residue:323
BDBM50427629
NameBDBM50427629
Synonyms:CHEMBL179587 | US9346803, Table 2, Compound 7: 2-[5-methoxy-2-methyl-1-(4-methylbenzoyl)-1H-indol-3-yl]acetic acid
TypeSmall organic molecule
Emp. Form.C20H19NO4
Mol. Mass.337.3692
SMILESCOc1ccc2n(C(=O)c3ccc(C)cc3)c(C)c(CC(O)=O)c2c1