Reaction Details
TargetAldo-keto reductase family 1 member C3
LigandBDBM50427665
Substrate/Competitorn/a
Meas. Tech.ChEMBL_941824 (CHEMBL2329815)
IC50 340±n/a nM
Citation Liedtke, AJAdeniji, AOChen, MByrns, MCJin, YChristianson, DWMarnett, LJPenning, TM Development of potent and selective indomethacin analogues for the inhibition of AKR1C3 (Type 5 17ß-hydroxysteroid dehydrogenase/prostaglandin F synthase) in castrate-resistant prostate cancer. J Med Chem56:2429-46 (2013) 
 
Aldo-keto reductase family 1 member C3
Name:Aldo-keto reductase family 1 member C3
Type:Enzyme
Mol. Mass.:36859.86
Organism:Homo sapiens (Human)
Description:P42330
Residue:323
BDBM50427665
NameBDBM50427665
Synonyms:CHEMBL2323525
TypeSmall organic molecule
Emp. Form.C21H18ClNO4
Mol. Mass.383.825
SMILESCOc1ccc2n(C(=O)c3ccc(Cl)cc3)c3CC(CCc3c2c1)C(O)=O