Reaction Details
TargetAldo-keto reductase family 1 member C3
LigandBDBM50427671
Substrate/Competitorn/a
Meas. Tech.ChEMBL_941824 (CHEMBL2329815)
IC50 1110±n/a nM
Citation Liedtke, AJAdeniji, AOChen, MByrns, MCJin, YChristianson, DWMarnett, LJPenning, TM Development of potent and selective indomethacin analogues for the inhibition of AKR1C3 (Type 5 17ß-hydroxysteroid dehydrogenase/prostaglandin F synthase) in castrate-resistant prostate cancer. J Med Chem56:2429-46 (2013) 
 
Aldo-keto reductase family 1 member C3
Name:Aldo-keto reductase family 1 member C3
Type:Enzyme
Mol. Mass.:36859.86
Organism:Homo sapiens (Human)
Description:P42330
Residue:323
BDBM50427671
NameBDBM50427671
Synonyms:CHEMBL2323517
TypeSmall organic molecule
Emp. Form.C27H22ClF3N2O5S
Mol. Mass.578.987
SMILESCOc1ccc2n(C(=O)c3ccc(Cl)cc3)c(CCC(=O)NS(=O)(=O)c3ccc(cc3)C(F)(F)F)c(C)c2c1