Reaction Details
TargetAldo-keto reductase family 1 member C3
LigandBDBM50427632
Substrate/Competitorn/a
Meas. Tech.ChEMBL_941824 (CHEMBL2329815)
IC50 120±n/a nM
Citation Liedtke, AJAdeniji, AOChen, MByrns, MCJin, YChristianson, DWMarnett, LJPenning, TM Development of potent and selective indomethacin analogues for the inhibition of AKR1C3 (Type 5 17ß-hydroxysteroid dehydrogenase/prostaglandin F synthase) in castrate-resistant prostate cancer. J Med Chem56:2429-46 (2013) 
 
Aldo-keto reductase family 1 member C3
Name:Aldo-keto reductase family 1 member C3
Type:Enzyme
Mol. Mass.:36859.86
Organism:Homo sapiens (Human)
Description:P42330
Residue:323
BDBM50427632
NameBDBM50427632
Synonyms:CHEMBL2323509
TypeSmall organic molecule
Emp. Form.C22H22ClNO4
Mol. Mass.399.867
SMILESCOc1ccc2n(C(=O)c3ccc(Cl)cc3)c(CC(C)(C)C(O)=O)c(C)c2c1