Reaction Details
TargetAldo-keto reductase family 1 member C3
LigandBDBM50427644
Substrate/Competitorn/a
Meas. Tech.ChEMBL_941824 (CHEMBL2329815)
IC50 2070±n/a nM
Citation Liedtke, AJAdeniji, AOChen, MByrns, MCJin, YChristianson, DWMarnett, LJPenning, TM Development of potent and selective indomethacin analogues for the inhibition of AKR1C3 (Type 5 17ß-hydroxysteroid dehydrogenase/prostaglandin F synthase) in castrate-resistant prostate cancer. J Med Chem56:2429-46 (2013) 
 
Aldo-keto reductase family 1 member C3
Name:Aldo-keto reductase family 1 member C3
Type:Enzyme
Mol. Mass.:36859.86
Organism:Homo sapiens (Human)
Description:P42330
Residue:323
BDBM50427644
NameBDBM50427644
Synonyms:CHEMBL2323494
TypeSmall organic molecule
Emp. Form.C25H18ClF3N2O5S
Mol. Mass.550.934
SMILESCOc1ccc2n(cc(CC(=O)NS(=O)(=O)c3ccc(cc3)C(F)(F)F)c2c1)C(=O)c1ccc(Cl)cc1