Reaction Details
TargetAldo-keto reductase family 1 member C2
LigandBDBM50427667
Substrate/Competitorn/a
Meas. Tech.ChEMBL_941825 (CHEMBL2329816)
IC50 100000±n/a nM
Citation Liedtke, AJAdeniji, AOChen, MByrns, MCJin, YChristianson, DWMarnett, LJPenning, TM Development of potent and selective indomethacin analogues for the inhibition of AKR1C3 (Type 5 17ß-hydroxysteroid dehydrogenase/prostaglandin F synthase) in castrate-resistant prostate cancer. J Med Chem56:2429-46 (2013) 
 
Aldo-keto reductase family 1 member C2
Name:Aldo-keto reductase family 1 member C2
Type:Enzyme
Mol. Mass.:36739.89
Organism:Homo sapiens (Human)
Description:n/a
Residue:323
BDBM50427667
NameBDBM50427667
Synonyms:CHEMBL2323523
TypeSmall organic molecule
Emp. Form.C22H18F3NO4
Mol. Mass.417.3778
SMILESCOc1ccc2n(C(=O)c3cccc(c3)C(F)(F)F)c3CCC(Cc3c2c1)C(O)=O