Reaction Details
TargetC-X-C chemokine receptor type 1
LigandBDBM7460
Substrate/Competitorn/a
Meas. Tech.ChEMBL_941878 (CHEMBL2329944)
IC50 4500±n/a nM
Citation Sassano, MFDoak, AKRoth, BLShoichet, BK Colloidal aggregation causes inhibition of G protein-coupled receptors. J Med Chem56:2406-14 (2013) 
 
C-X-C chemokine receptor type 1
Name:C-X-C chemokine receptor type 1
Type:Enzyme
Mol. Mass.:39803.83
Organism:Homo sapiens (Human)
Description:P25024
Residue:350
BDBM7460
NameBDBM7460
Synonyms:2-(3,4-dihydroxyphenyl)-3,5,7-trihydroxy-4H-chromen-4-one 2-(3,4-dihydroxyphenyl)-3,5,7-trihydroxy-chromone;hydrate Quercetin Quercetin (21) US11021454, Compound Quercetin med.21724, Compound 4
TypeSmall organic molecule
Emp. Form.C15H10O7
Mol. Mass.302.2357
SMILESOc1cc(O)c2c(c1)oc(-c1ccc(O)c(O)c1)c(O)c2=O