Reaction Details
TargetTyrosine-protein kinase ABL1
LigandBDBM50427747
Substrate/Competitorn/a
Meas. Tech.ChEMBL_941940 (CHEMBL2330097)
IC50 27±n/a nM
Citation Desai, BDixon, KFarrant, EFeng, QGibson, KRvan Hoorn, WPMills, JMorgan, TParry, DMRamjee, MKSelway, CNTarver, GJWhitlock, GWright, AG Rapid discovery of a novel series of Abl kinase inhibitors by application of an integrated microfluidic synthesis and screening platform. J Med Chem56:3033-47 (2013) 
 
Tyrosine-protein kinase ABL1
Name:Tyrosine-protein kinase ABL1
Type:Enzyme
Mol. Mass.:122897.30
Organism:Homo sapiens (Human)
Description:P00519
Residue:1130
BDBM50427747
NameBDBM50427747
Synonyms:CHEMBL2324926
TypeSmall organic molecule
Emp. Form.C26H26F3N9O
Mol. Mass.537.5395
SMILESCN1CCN(Cc2ccc(NC(=O)Nc3cc(C#Cc4cnc5cccnn45)n(C)n3)cc2C(F)(F)F)CC1