Reaction Details
TargetMitogen-activated protein kinase 14
LigandBDBM50427749
Substrate/Competitorn/a
Meas. Tech.ChEMBL_941928 (CHEMBL2330085)
IC50 43±n/a nM
Citation Desai, BDixon, KFarrant, EFeng, QGibson, KRvan Hoorn, WPMills, JMorgan, TParry, DMRamjee, MKSelway, CNTarver, GJWhitlock, GWright, AG Rapid discovery of a novel series of Abl kinase inhibitors by application of an integrated microfluidic synthesis and screening platform. J Med Chem56:3033-47 (2013) 
 
Mitogen-activated protein kinase 14
Name:Mitogen-activated protein kinase 14
Type:Serine/threonine-protein kinase
Mol. Mass.:41286.76
Organism:Homo sapiens (Human)
Description:Q16539
Residue:360
BDBM50427749
NameBDBM50427749
Synonyms:CHEMBL2324924
TypeSmall organic molecule
Emp. Form.C29H27F3N6O
Mol. Mass.532.5595
SMILESCN1CCN(Cc2ccc(NC(=O)c3ccc(C)c(c3)C#Cc3cncc4nccn34)cc2C(F)(F)F)CC1