Reaction Details
TargetProtein arginine N-methyltransferase 3 [N508S]
LigandBDBM50427754
Substrate/Competitorn/a
Meas. Tech.ChEMBL_941988 (CHEMBL2330282)
IC50 7200±n/a nM
Citation Liu, FLi, FMa, ADobrovetsky, EDong, AGao, CKorboukh, ILiu, JSmil, DBrown, PJFrye, SVArrowsmith, CHSchapira, MVedadi, MJin, J Exploiting an allosteric binding site of PRMT3 yields potent and selective inhibitors. J Med Chem56:2110-24 (2013) 
 
Protein arginine N-methyltransferase 3 [N508S]
Name:Protein arginine N-methyltransferase 3 [N508S]
Type:Protein
Mol. Mass.:59859.85
Organism:Homo sapiens (Human)
Description:O60678[N508S]
Residue:531
BDBM50427754
NameBDBM50427754
Synonyms:CHEMBL2325166
TypeSmall organic molecule
Emp. Form.C14H19N5O2S
Mol. Mass.321.398
SMILESO=C(NCCCN1CCOCC1)Nc1ccc2nnsc2c1