Reaction Details
TargetProtein arginine N-methyltransferase 3 [N508S]
LigandBDBM50427758
Substrate/Competitorn/a
Meas. Tech.ChEMBL_941988 (CHEMBL2330282)
IC50>100000±n/a nM
Citation Liu, FLi, FMa, ADobrovetsky, EDong, AGao, CKorboukh, ILiu, JSmil, DBrown, PJFrye, SVArrowsmith, CHSchapira, MVedadi, MJin, J Exploiting an allosteric binding site of PRMT3 yields potent and selective inhibitors. J Med Chem56:2110-24 (2013) 
 
Protein arginine N-methyltransferase 3 [N508S]
Name:Protein arginine N-methyltransferase 3 [N508S]
Type:Protein
Mol. Mass.:59859.85
Organism:Homo sapiens (Human)
Description:O60678[N508S]
Residue:531
BDBM50427758
NameBDBM50427758
Synonyms:CHEMBL2325162
TypeSmall organic molecule
Emp. Form.C16H20N6S
Mol. Mass.328.435
SMILESC(Cc1nnc(Nc2ccc3nnsc3c2)[nH]1)C1CCCCC1