Reaction Details
TargetHistone-lysine N-methyltransferase SUV39H2
LigandBDBM50427772
Substrate/Competitorn/a
Meas. Tech.ChEMBL_941985 (CHEMBL2330205)
IC50 22000±n/a nM
Citation Liu, FLi, FMa, ADobrovetsky, EDong, AGao, CKorboukh, ILiu, JSmil, DBrown, PJFrye, SVArrowsmith, CHSchapira, MVedadi, MJin, J Exploiting an allosteric binding site of PRMT3 yields potent and selective inhibitors. J Med Chem56:2110-24 (2013) 
 
Histone-lysine N-methyltransferase SUV39H2
Name:Histone-lysine N-methyltransferase SUV39H2
Type:Enzyme
Mol. Mass.:46692.47
Organism:Homo sapiens (Human)
Description:Q9H5I1
Residue:410
BDBM50427772
NameBDBM50427772
Synonyms:CHEMBL2325183
TypeSmall organic molecule
Emp. Form.C15H12N4O2S
Mol. Mass.312.346
SMILESO=C(NCC(=O)c1ccccc1)Nc1ccc2nnsc2c1