Reaction Details
TargetProtein arginine N-methyltransferase 3 [N508S]
LigandBDBM50427787
Substrate/Competitorn/a
Meas. Tech.ChEMBL_941988 (CHEMBL2330282)
IC50 230±n/a nM
Citation Liu, FLi, FMa, ADobrovetsky, EDong, AGao, CKorboukh, ILiu, JSmil, DBrown, PJFrye, SVArrowsmith, CHSchapira, MVedadi, MJin, J Exploiting an allosteric binding site of PRMT3 yields potent and selective inhibitors. J Med Chem56:2110-24 (2013) 
 
Protein arginine N-methyltransferase 3 [N508S]
Name:Protein arginine N-methyltransferase 3 [N508S]
Type:Protein
Mol. Mass.:59859.85
Organism:Homo sapiens (Human)
Description:O60678[N508S]
Residue:531
BDBM50427787
NameBDBM50427787
Synonyms:CHEMBL2325198
TypeSmall organic molecule
Emp. Form.C14H17N5O2S
Mol. Mass.319.382
SMILESO=C(NCC(=O)N1CCCCC1)Nc1ccc2nnsc2c1