Reaction Details
TargetProtein arginine N-methyltransferase 3 [N508S]
LigandBDBM50427797
Substrate/Competitorn/a
Meas. Tech.ChEMBL_941988 (CHEMBL2330282)
IC50 5300±n/a nM
Citation Liu, FLi, FMa, ADobrovetsky, EDong, AGao, CKorboukh, ILiu, JSmil, DBrown, PJFrye, SVArrowsmith, CHSchapira, MVedadi, MJin, J Exploiting an allosteric binding site of PRMT3 yields potent and selective inhibitors. J Med Chem56:2110-24 (2013) 
 
Protein arginine N-methyltransferase 3 [N508S]
Name:Protein arginine N-methyltransferase 3 [N508S]
Type:Protein
Mol. Mass.:59859.85
Organism:Homo sapiens (Human)
Description:O60678[N508S]
Residue:531
BDBM50427797
NameBDBM50427797
Synonyms:CHEMBL2325188
TypeSmall organic molecule
Emp. Form.C16H23N5OS
Mol. Mass.333.452
SMILESN[C@H]1CC[C@H](CCCNC(=O)Nc2ccc3nnsc3c2)CC1