Reaction Details
TargetPhospholipase D1
LigandBDBM50427804
Substrate/Competitorn/a
Meas. Tech.ChEMBL_942034 (CHEMBL2330403)
IC50 86±n/a nM
Citation O'Reilly, MCScott, SABrown, KAOguin, THThomas, PGDaniels, JSMorrison, RBrown, HALindsley, CW Development of dual PLD1/2 and PLD2 selective inhibitors from a common 1,3,8-Triazaspiro[4.5]decane Core: discovery of Ml298 and Ml299 that decrease invasive migration in U87-MG glioblastoma cells. J Med Chem56:2695-9 (2013) 
 
Phospholipase D1
Name:Phospholipase D1
Type:Protein
Mol. Mass.:124219.92
Organism:Homo sapiens (Human)
Description:Q13393
Residue:1074
BDBM50427804
NameBDBM50427804
Synonyms:CHEMBL2325487
TypeSmall organic molecule
Emp. Form.C23H25F3N4O2
Mol. Mass.446.4654
SMILESC[C@@H](CN1CCC2(CC1)N(CNC2=O)c1cccc(F)c1)NC(=O)c1ccc(F)c(F)c1