Reaction Details
TargetIsoform 1 of Steroid hormone receptor ERR2 (ERRbeta2-delta10)
LigandBDBM50427835
Substrate/Competitorn/a
Meas. Tech.ChEMBL_940755 (CHEMBL2330135)
IC50 151±n/a nM
Citation Jiang, XRWang, PSmith, CLZhu, BT Synthesis of novel estrogen receptor antagonists using metal-catalyzed coupling reactions and characterization of their biological activity. J Med Chem56:2779-90 (2013) 
 
Isoform 1 of Steroid hormone receptor ERR2 (ERRbeta2-delta10)
Name:Isoform 1 of Steroid hormone receptor ERR2 (ERRbeta2-delta10)
Type:PROTEIN
Mol. Mass.:56220.72
Organism:Homo sapiens (Human)
Description:ChEMBL_940755
Residue:508
BDBM50427835
NameBDBM50427835
Synonyms:CHEMBL2326069
TypeSmall organic molecule
Emp. Form.C38H48O6
Mol. Mass.600.7841
SMILESCCOC(=O)C(Cc1ccc(cc1)C#CCCCC[C@@H]1Cc2cc(O)ccc2[C@H]2CC[C@]3(C)[C@@H](O)CC[C@H]3[C@H]12)C(=O)OCC