Reaction Details
TargetMatrix metalloproteinase-9
LigandBDBM50427869
Substrate/Competitorn/a
Meas. Tech.ChEMBL_940801 (CHEMBL2330329)
IC50 1500±n/a nM
Citation Casalini, FFugazza, LEsposito, GCabella, CBrioschi, CCordaro, AD'Angeli, LBartoli, AFilannino, AMGringeri, CVLongo, DLMuzio, VNuti, EOrlandini, EFiglia, GQuattrini, ATei, LDigilio, GRossello, AMaiocchi, A Synthesis and preliminary evaluation in tumor bearing mice of new (18)F-labeled arylsulfone matrix metalloproteinase inhibitors as tracers for positron emission tomography. J Med Chem56:2676-89 (2013) 
 
Matrix metalloproteinase-9
Name:Matrix metalloproteinase-9
Type:Enzyme
Mol. Mass.:78452.28
Organism:Homo sapiens (Human)
Description:P14780
Residue:707
BDBM50427869
NameBDBM50427869
Synonyms:CHEMBL2326365
TypeSmall organic molecule
Emp. Form.C22H18FNO5S
Mol. Mass.427.445
SMILESOC(=O)Cc1ccccc1S(=O)(=O)c1ccc(cc1)-c1ccc(NC(=O)CF)cc1