Reaction Details
TargetCalcium/calmodulin-dependent protein kinase type II subunit alpha
LigandBDBM50427874
Substrate/Competitorn/a
Meas. Tech.ChEMBL_940855 (CHEMBL2330435)
IC50>10000±n/a nM
Citation Lourido, SZhang, CLopez, MSTang, KBarks, JWang, QWildman, SAShokat, KMSibley, LD Optimizing small molecule inhibitors of calcium-dependent protein kinase 1 to prevent infection by Toxoplasma gondii. J Med Chem56:3068-77 (2013) 
 
Calcium/calmodulin-dependent protein kinase type II subunit alpha
Name:Calcium/calmodulin-dependent protein kinase type II subunit alpha
Type:Enzyme Catalytic Domain
Mol. Mass.:54093.63
Organism:Homo sapiens (Human)
Description:gi_25952118
Residue:478
BDBM50427874
NameBDBM50427874
Synonyms:CHEMBL2324596
TypeSmall organic molecule
Emp. Form.C13H12N4
Mol. Mass.224.2612
SMILESCc1cccc(Cc2[nH]nc3ncncc23)c1